Reaction Details
TargetSerine/threonine-protein kinase B-raf
LigandBDBM50176317
Substrate/Competitorn/a
Meas. Tech.ChEMBL_327805 (CHEMBL869914)
Kd 5±n/a nM
Citation Takle, AKBrown, MJDavies, SDean, DKFrancis, GGaiba, AHird, AWKing, FDLovell, PJNaylor, AReith, ADSteadman, JGWilson, DM The identification of potent and selective imidazole-based inhibitors of B-Raf kinase. Bioorg Med Chem Lett16:378-81 (2005) 
 
Serine/threonine-protein kinase B-raf
Name:Serine/threonine-protein kinase B-raf
Type:Serine/threonine-protein kinase
Mol. Mass.:84446.00
Organism:Homo sapiens (Human)
Description:P15056
Residue:766
BDBM50176317
NameBDBM50176317
Synonyms:4-(2-phenyl-5-(pyridin-4-yl)-1H-imidazol-4-yl)benzaldehyde oxime | CHEMBL200783
TypeSmall organic molecule
Emp. Form.C21H16N4O
Mol. Mass.340.3779
SMILESO=NCc1ccc(cc1)-c1[nH]c(nc1-c1ccncc1)-c1ccccc1