Reaction Details
TargetSerine/threonine-protein kinase B-raf
LigandBDBM50176320
Substrate/Competitorn/a
Meas. Tech.ChEMBL_327805 (CHEMBL869914)
Kd 10±n/a nM
Citation Takle, AKBrown, MJDavies, SDean, DKFrancis, GGaiba, AHird, AWKing, FDLovell, PJNaylor, AReith, ADSteadman, JGWilson, DM The identification of potent and selective imidazole-based inhibitors of B-Raf kinase. Bioorg Med Chem Lett16:378-81 (2005) 
 
Serine/threonine-protein kinase B-raf
Name:Serine/threonine-protein kinase B-raf
Type:Serine/threonine-protein kinase
Mol. Mass.:84446.00
Organism:Homo sapiens (Human)
Description:P15056
Residue:766
BDBM50176320
NameBDBM50176320
Synonyms:CHEMBL381447 | N-(2-(4-(4-chloro-3-hydroxyphenyl)-5-(pyridin-4-yl)-1H-imidazol-2-yl)-2-methylpropyl)methanesulfonamide
TypeSmall organic molecule
Emp. Form.C19H21ClN4O3S
Mol. Mass.420.913
SMILESCC(C)(CNS(C)(=O)=O)c1nc(c([nH]1)-c1ccc(Cl)c(O)c1)-c1ccncc1