Reaction Details
TargetSerine/threonine-protein kinase B-raf
LigandBDBM50077961
Substrate/Competitorn/a
Meas. Tech.ChEMBL_327805 (CHEMBL869914)
Kd 8±n/a nM
Citation Takle, AKBrown, MJDavies, SDean, DKFrancis, GGaiba, AHird, AWKing, FDLovell, PJNaylor, AReith, ADSteadman, JGWilson, DM The identification of potent and selective imidazole-based inhibitors of B-Raf kinase. Bioorg Med Chem Lett16:378-81 (2005) 
 
Serine/threonine-protein kinase B-raf
Name:Serine/threonine-protein kinase B-raf
Type:Serine/threonine-protein kinase
Mol. Mass.:84446.00
Organism:Homo sapiens (Human)
Description:P15056
Residue:766
BDBM50077961
NameBDBM50077961
Synonyms:3-(2-Phenyl-5-pyridin-4-yl-1H-imidazol-4-yl)-phenol CHEMBL304624
TypeSmall organic molecule
Emp. Form.C20H15N3O
Mol. Mass.313.3526
SMILESOc1cccc(c1)-c1[nH]c(nc1-c1ccncc1)-c1ccccc1