Reaction Details
TargetSerine/threonine-protein kinase B-raf
LigandBDBM50176321
Substrate/Competitorn/a
Meas. Tech.ChEMBL_327805 (CHEMBL869914)
Kd 5.7±n/a nM
Citation Takle, AKBrown, MJDavies, SDean, DKFrancis, GGaiba, AHird, AWKing, FDLovell, PJNaylor, AReith, ADSteadman, JGWilson, DM The identification of potent and selective imidazole-based inhibitors of B-Raf kinase. Bioorg Med Chem Lett16:378-81 (2005) 
 
Serine/threonine-protein kinase B-raf
Name:Serine/threonine-protein kinase B-raf
Type:Serine/threonine-protein kinase
Mol. Mass.:84446.00
Organism:Homo sapiens (Human)
Description:P15056
Residue:766
BDBM50176321
NameBDBM50176321
Synonyms:5-(5-(2-aminopyrimidin-4-yl)-2-phenyl-1H-imidazol-4-yl)-2-chlorophenol | CHEMBL200258
TypeSmall organic molecule
Emp. Form.C19H14ClN5O
Mol. Mass.363.8
SMILESNc1nccc(n1)-c1nc([nH]c1-c1ccc(Cl)c(O)c1)-c1ccccc1