Reaction Details
TargetSerine/threonine-protein kinase B-raf
LigandBDBM50176326
Substrate/Competitorn/a
Meas. Tech.ChEMBL_327805 (CHEMBL869914)
Kd 14±n/a nM
Citation Takle, AKBrown, MJDavies, SDean, DKFrancis, GGaiba, AHird, AWKing, FDLovell, PJNaylor, AReith, ADSteadman, JGWilson, DM The identification of potent and selective imidazole-based inhibitors of B-Raf kinase. Bioorg Med Chem Lett16:378-81 (2005) 
 
Serine/threonine-protein kinase B-raf
Name:Serine/threonine-protein kinase B-raf
Type:Serine/threonine-protein kinase
Mol. Mass.:84446.00
Organism:Homo sapiens (Human)
Description:P15056
Residue:766
BDBM50176326
NameBDBM50176326
Synonyms:2-chloro-5-(2-phenyl-5-(pyrimidin-4-yl)-1H-imidazol-4-yl)phenol | CHEMBL370353
TypeSmall organic molecule
Emp. Form.C19H13ClN4O
Mol. Mass.348.786
SMILESOc1cc(ccc1Cl)-c1[nH]c(nc1-c1ccncn1)-c1ccccc1