Reaction Details
TargetSerine/threonine-protein kinase B-raf
LigandBDBM50176331
Substrate/Competitorn/a
Meas. Tech.ChEMBL_327805 (CHEMBL869914)
Kd 17±n/a nM
Citation Takle, AKBrown, MJDavies, SDean, DKFrancis, GGaiba, AHird, AWKing, FDLovell, PJNaylor, AReith, ADSteadman, JGWilson, DM The identification of potent and selective imidazole-based inhibitors of B-Raf kinase. Bioorg Med Chem Lett16:378-81 (2005) 
 
Serine/threonine-protein kinase B-raf
Name:Serine/threonine-protein kinase B-raf
Type:Serine/threonine-protein kinase
Mol. Mass.:84446.00
Organism:Homo sapiens (Human)
Description:P15056
Residue:766
BDBM50176331
NameBDBM50176331
Synonyms:6-(2-phenyl-5-(pyridin-4-yl)-1H-imidazol-4-yl)-3,4-dihydronaphthalen-1(2H)-one oxime | CHEMBL200164
TypeSmall organic molecule
Emp. Form.C24H20N4O
Mol. Mass.380.4418
SMILESO=NC1CCCc2cc(ccc12)-c1[nH]c(nc1-c1ccncc1)-c1ccccc1