Reaction Details
TargetSerine/threonine-protein kinase B-raf
LigandBDBM26040
Substrate/Competitorn/a
Meas. Tech.ChEMBL_327805 (CHEMBL869914)
Kd 5.3±n/a nM
Citation Takle, AKBrown, MJDavies, SDean, DKFrancis, GGaiba, AHird, AWKing, FDLovell, PJNaylor, AReith, ADSteadman, JGWilson, DM The identification of potent and selective imidazole-based inhibitors of B-Raf kinase. Bioorg Med Chem Lett16:378-81 (2005) 
 
Serine/threonine-protein kinase B-raf
Name:Serine/threonine-protein kinase B-raf
Type:Serine/threonine-protein kinase
Mol. Mass.:84446.00
Organism:Homo sapiens (Human)
Description:P15056
Residue:766
BDBM26040
NameBDBM26040
Synonyms:5-{2-[4-(aminomethyl)phenyl]-5-(pyridin-4-yl)-1H-imidazol-4-yl}-2-chlorophenol Rhodamine green labeled 5-{2-[4-(aminomethyl)phenyl]-5-pyridin-4-yl-1H-imidazol-4-yl}-2-chlorophenol | Rhodamine green labeled ligand
Typefluorescent ligand
Emp. Form.C21H17ClN4O
Mol. Mass.376.839
SMILESNCc1ccc(cc1)-c1nc(c([nH]1)-c1ccc(Cl)c(O)c1)-c1ccncc1