Reaction Details
TargetSerine/threonine-protein kinase B-raf
LigandBDBM50176335
Substrate/Competitorn/a
Meas. Tech.ChEMBL_327805 (CHEMBL869914)
Kd 2±n/a nM
Citation Takle, AKBrown, MJDavies, SDean, DKFrancis, GGaiba, AHird, AWKing, FDLovell, PJNaylor, AReith, ADSteadman, JGWilson, DM The identification of potent and selective imidazole-based inhibitors of B-Raf kinase. Bioorg Med Chem Lett16:378-81 (2005) 
 
Serine/threonine-protein kinase B-raf
Name:Serine/threonine-protein kinase B-raf
Type:Serine/threonine-protein kinase
Mol. Mass.:84446.00
Organism:Homo sapiens (Human)
Description:P15056
Residue:766
BDBM50176335
NameBDBM50176335
Synonyms:5-(2-tert-butyl-5-(pyridin-4-yl)-1H-imidazol-4-yl)-2-chlorophenol | CHEMBL200172
TypeSmall organic molecule
Emp. Form.C18H18ClN3O
Mol. Mass.327.808
SMILESCC(C)(C)c1nc(c([nH]1)-c1ccc(Cl)c(O)c1)-c1ccncc1