Reaction Details
TargetSerine/threonine-protein kinase B-raf
LigandBDBM50176329
Substrate/Competitorn/a
Meas. Tech.ChEMBL_327805 (CHEMBL869914)
Kd 4.2±n/a nM
Citation Takle, AKBrown, MJDavies, SDean, DKFrancis, GGaiba, AHird, AWKing, FDLovell, PJNaylor, AReith, ADSteadman, JGWilson, DM The identification of potent and selective imidazole-based inhibitors of B-Raf kinase. Bioorg Med Chem Lett16:378-81 (2005) 
 
Serine/threonine-protein kinase B-raf
Name:Serine/threonine-protein kinase B-raf
Type:Serine/threonine-protein kinase
Mol. Mass.:84446.00
Organism:Homo sapiens (Human)
Description:P15056
Residue:766
BDBM50176329
NameBDBM50176329
Synonyms:2-chloro-5-(2-(furan-2-yl)-5-(pyridin-4-yl)-1H-imidazol-4-yl)phenol | CHEMBL371952
TypeSmall organic molecule
Emp. Form.C18H12ClN3O2
Mol. Mass.337.76
SMILESOc1cc(ccc1Cl)-c1[nH]c(nc1-c1ccncc1)-c1ccco1