Reaction Details
TargetSerine/threonine-protein kinase B-raf
LigandBDBM50176339
Substrate/Competitorn/a
Meas. Tech.ChEMBL_327805 (CHEMBL869914)
Kd 11±n/a nM
Citation Takle, AKBrown, MJDavies, SDean, DKFrancis, GGaiba, AHird, AWKing, FDLovell, PJNaylor, AReith, ADSteadman, JGWilson, DM The identification of potent and selective imidazole-based inhibitors of B-Raf kinase. Bioorg Med Chem Lett16:378-81 (2005) 
 
Serine/threonine-protein kinase B-raf
Name:Serine/threonine-protein kinase B-raf
Type:Serine/threonine-protein kinase
Mol. Mass.:84446.00
Organism:Homo sapiens (Human)
Description:P15056
Residue:766
BDBM50176339
NameBDBM50176339
Synonyms:1-(4-(2-phenyl-5-(pyridin-4-yl)-1H-imidazol-4-yl)phenyl)ethanone oxime | CHEMBL200637
TypeSmall organic molecule
Emp. Form.C22H18N4O
Mol. Mass.354.4045
SMILESCC(N=O)c1ccc(cc1)-c1[nH]c(nc1-c1ccncc1)-c1ccccc1