Reaction Details
TargetReceptor tyrosine-protein kinase erbB-2
LigandBDBM50182678
Substrate/Competitorn/a
Meas. Tech.ChEMBL_334487 (CHEMBL862521)
IC50 2±n/a nM
Citation Klutchko, SRZhou, HWinters, RTTran, TPBridges, AJAlthaus, IWAmato, DMElliott, WLEllis, PAMeade, MARoberts, BJFry, DWGonzales, AJHarvey, PJNelson, JMSherwood, VHan, HKPace, GSmaill, JBDenny, WAShowalter, HD Tyrosine kinase inhibitors. 19. 6-Alkynamides of 4-anilinoquinazolines and 4-anilinopyrido[3,4-d]pyrimidines as irreversible inhibitors of the erbB family of tyrosine kinase receptors. J Med Chem49:1475-85 (2006) 
 
Receptor tyrosine-protein kinase erbB-2
Name:Receptor tyrosine-protein kinase erbB-2
Type:n/a
Mol. Mass.:137894.47
Organism:Homo sapiens (Human)
Description:P04626
Residue:1255
BDBM50182678
NameBDBM50182678
Synonyms:CHEMBL205059 | N-[4-[(3-chloro-4-fluorophenyl)amino]pyrido[3,4-d]pyrimidin-6-yl]-5-(1-piperidinyl)-2-pentynamide
TypeSmall organic molecule
Emp. Form.C23H22ClFN6O
Mol. Mass.452.912
SMILESFc1ccc(Nc2ncnc3cnc(NC(=O)C#CCCN4CCCCC4)cc23)cc1Cl