Reaction Details
TargetReceptor tyrosine-protein kinase erbB-4
LigandBDBM50182680
Substrate/Competitorn/a
Meas. Tech.ChEMBL_334485 (CHEMBL862514)
IC50 310±n/a nM
Citation Klutchko, SRZhou, HWinters, RTTran, TPBridges, AJAlthaus, IWAmato, DMElliott, WLEllis, PAMeade, MARoberts, BJFry, DWGonzales, AJHarvey, PJNelson, JMSherwood, VHan, HKPace, GSmaill, JBDenny, WAShowalter, HD Tyrosine kinase inhibitors. 19. 6-Alkynamides of 4-anilinoquinazolines and 4-anilinopyrido[3,4-d]pyrimidines as irreversible inhibitors of the erbB family of tyrosine kinase receptors. J Med Chem49:1475-85 (2006) 
 
Receptor tyrosine-protein kinase erbB-4
Name:Receptor tyrosine-protein kinase erbB-4
Type:Protein
Mol. Mass.:146803.56
Organism:Homo sapiens (Human)
Description:Q15303
Residue:1308
BDBM50182680
NameBDBM50182680
Synonyms:CHEMBL373207 | N-[4-[(3-chloro-4-fluorophenyl)amino]-6-quinazolinyl]-4-(diethylamino)-2-butynamide
TypeSmall organic molecule
Emp. Form.C22H21ClFN5O
Mol. Mass.425.886
SMILESCCN(CC)CC#CC(=O)Nc1ccc2ncnc(Nc3ccc(F)c(Cl)c3)c2c1