Reaction Details
TargetReceptor tyrosine-protein kinase erbB-2
LigandBDBM50182690
Substrate/Competitorn/a
Meas. Tech.ChEMBL_334487 (CHEMBL862521)
IC50 43±n/a nM
Citation Klutchko, SRZhou, HWinters, RTTran, TPBridges, AJAlthaus, IWAmato, DMElliott, WLEllis, PAMeade, MARoberts, BJFry, DWGonzales, AJHarvey, PJNelson, JMSherwood, VHan, HKPace, GSmaill, JBDenny, WAShowalter, HD Tyrosine kinase inhibitors. 19. 6-Alkynamides of 4-anilinoquinazolines and 4-anilinopyrido[3,4-d]pyrimidines as irreversible inhibitors of the erbB family of tyrosine kinase receptors. J Med Chem49:1475-85 (2006) 
 
Receptor tyrosine-protein kinase erbB-2
Name:Receptor tyrosine-protein kinase erbB-2
Type:n/a
Mol. Mass.:137894.47
Organism:Homo sapiens (Human)
Description:P04626
Residue:1255
BDBM50182690
NameBDBM50182690
Synonyms:CHEMBL202411 | N-[4-[(3-Chloro-4-fluorophenyl)amino]-6-quinazolinyl]-4-hydroxy-2-butynamide
TypeSmall organic molecule
Emp. Form.C18H12ClFN4O2
Mol. Mass.370.765
SMILESOCC#CC(=O)Nc1ccc2ncnc(Nc3ccc(F)c(Cl)c3)c2c1