Reaction Details
TargetEpidermal growth factor receptor
LigandBDBM50182677
Substrate/Competitorn/a
Meas. Tech.ChEMBL_334483 (CHEMBL862512)
IC50 3.1±n/a nM
Citation Klutchko, SRZhou, HWinters, RTTran, TPBridges, AJAlthaus, IWAmato, DMElliott, WLEllis, PAMeade, MARoberts, BJFry, DWGonzales, AJHarvey, PJNelson, JMSherwood, VHan, HKPace, GSmaill, JBDenny, WAShowalter, HD Tyrosine kinase inhibitors. 19. 6-Alkynamides of 4-anilinoquinazolines and 4-anilinopyrido[3,4-d]pyrimidines as irreversible inhibitors of the erbB family of tyrosine kinase receptors. J Med Chem49:1475-85 (2006) 
 
Epidermal growth factor receptor
Name:Epidermal growth factor receptor
Type:Receptor Kinase Domain
Mol. Mass.:134279.59
Organism:Homo sapiens (Human)
Description:P00533
Residue:1210
BDBM50182677
NameBDBM50182677
Synonyms:CHEMBL202556 | N-[4-[(3-chloro-4-fluorophenyl)amino]pyrido[3,4-d]pyrimidin-6-yl]-4-(4-morpholinyl)-2-butynamide
TypeSmall organic molecule
Emp. Form.C21H18ClFN6O2
Mol. Mass.440.858
SMILESFc1ccc(Nc2ncnc3cnc(NC(=O)C#CCN4CCOCC4)cc23)cc1Cl