Reaction Details
TargetReceptor tyrosine-protein kinase erbB-2
LigandBDBM4566
Substrate/Competitorn/a
Meas. Tech.ChEMBL_334484 (CHEMBL862513)
IC50 17±n/a nM
Citation Klutchko, SRZhou, HWinters, RTTran, TPBridges, AJAlthaus, IWAmato, DMElliott, WLEllis, PAMeade, MARoberts, BJFry, DWGonzales, AJHarvey, PJNelson, JMSherwood, VHan, HKPace, GSmaill, JBDenny, WAShowalter, HD Tyrosine kinase inhibitors. 19. 6-Alkynamides of 4-anilinoquinazolines and 4-anilinopyrido[3,4-d]pyrimidines as irreversible inhibitors of the erbB family of tyrosine kinase receptors. J Med Chem49:1475-85 (2006) 
 
Receptor tyrosine-protein kinase erbB-2
Name:Receptor tyrosine-protein kinase erbB-2
Type:n/a
Mol. Mass.:137894.47
Organism:Homo sapiens (Human)
Description:P04626
Residue:1255
BDBM4566
NameBDBM4566
Synonyms:4-anilinoquinazoline deriv. 1 N-{4-[(3-bromophenyl)amino]quinazolin-6-yl}but-2-ynamide
TypeSmall organic molecule
Emp. Form.C18H13BrN4O
Mol. Mass.381.226
SMILESCC#CC(=O)Nc1ccc2ncnc(Nc3cccc(Br)c3)c2c1