Reaction Details
TargetReceptor tyrosine-protein kinase erbB-2
LigandBDBM50182695
Substrate/Competitorn/a
Meas. Tech.ChEMBL_334484 (CHEMBL862513)
IC50 1.9±n/a nM
Citation Klutchko, SRZhou, HWinters, RTTran, TPBridges, AJAlthaus, IWAmato, DMElliott, WLEllis, PAMeade, MARoberts, BJFry, DWGonzales, AJHarvey, PJNelson, JMSherwood, VHan, HKPace, GSmaill, JBDenny, WAShowalter, HD Tyrosine kinase inhibitors. 19. 6-Alkynamides of 4-anilinoquinazolines and 4-anilinopyrido[3,4-d]pyrimidines as irreversible inhibitors of the erbB family of tyrosine kinase receptors. J Med Chem49:1475-85 (2006) 
 
Receptor tyrosine-protein kinase erbB-2
Name:Receptor tyrosine-protein kinase erbB-2
Type:n/a
Mol. Mass.:137894.47
Organism:Homo sapiens (Human)
Description:P04626
Residue:1255
BDBM50182695
NameBDBM50182695
Synonyms:CHEMBL202360 | N-[4-[(3-bromophenyl)amino]-6-quinazolinyl]-2-propynamide
TypeSmall organic molecule
Emp. Form.C17H11BrN4O
Mol. Mass.367.199
SMILESBrc1cccc(Nc2ncnc3ccc(NC(=O)C#C)cc23)c1