Reaction Details
TargetReceptor tyrosine-protein kinase erbB-2
LigandBDBM50182693
Substrate/Competitorn/a
Meas. Tech.ChEMBL_334487 (CHEMBL862521)
IC50 24±n/a nM
Citation Klutchko, SRZhou, HWinters, RTTran, TPBridges, AJAlthaus, IWAmato, DMElliott, WLEllis, PAMeade, MARoberts, BJFry, DWGonzales, AJHarvey, PJNelson, JMSherwood, VHan, HKPace, GSmaill, JBDenny, WAShowalter, HD Tyrosine kinase inhibitors. 19. 6-Alkynamides of 4-anilinoquinazolines and 4-anilinopyrido[3,4-d]pyrimidines as irreversible inhibitors of the erbB family of tyrosine kinase receptors. J Med Chem49:1475-85 (2006) 
 
Receptor tyrosine-protein kinase erbB-2
Name:Receptor tyrosine-protein kinase erbB-2
Type:n/a
Mol. Mass.:137894.47
Organism:Homo sapiens (Human)
Description:P04626
Residue:1255
BDBM50182693
NameBDBM50182693
Synonyms:CHEMBL203644 | N-[4-[(3-chloro-4-fluorophenyl)amino]pyrido[3,4-d]pyrimidin-6-yl]-2-butynamide
TypeSmall organic molecule
Emp. Form.C17H11ClFN5O
Mol. Mass.355.754
SMILESCC#CC(=O)Nc1cc2c(Nc3ccc(F)c(Cl)c3)ncnc2cn1