Reaction Details
TargetReceptor tyrosine-protein kinase erbB-2
LigandBDBM50182684
Substrate/Competitorn/a
Meas. Tech.ChEMBL_334487 (CHEMBL862521)
IC50 3.5±n/a nM
Citation Klutchko, SRZhou, HWinters, RTTran, TPBridges, AJAlthaus, IWAmato, DMElliott, WLEllis, PAMeade, MARoberts, BJFry, DWGonzales, AJHarvey, PJNelson, JMSherwood, VHan, HKPace, GSmaill, JBDenny, WAShowalter, HD Tyrosine kinase inhibitors. 19. 6-Alkynamides of 4-anilinoquinazolines and 4-anilinopyrido[3,4-d]pyrimidines as irreversible inhibitors of the erbB family of tyrosine kinase receptors. J Med Chem49:1475-85 (2006) 
 
Receptor tyrosine-protein kinase erbB-2
Name:Receptor tyrosine-protein kinase erbB-2
Type:n/a
Mol. Mass.:137894.47
Organism:Homo sapiens (Human)
Description:P04626
Residue:1255
BDBM50182684
NameBDBM50182684
Synonyms:CHEMBL437890 | N-[4-[(3-bromo-4-fluorophenyl)amino]pyrido[3,4-d]pyrimidin-6-yl]-5-(4-methyl-1-piperazinyl)-2-pentynamide
TypeSmall organic molecule
Emp. Form.C23H23BrFN7O
Mol. Mass.512.377
SMILESCN1CCN(CCC#CC(=O)Nc2cc3c(Nc4ccc(F)c(Br)c4)ncnc3cn2)CC1