Reaction Details
TargetEpidermal growth factor receptor
LigandBDBM50182688
Substrate/Competitorn/a
Meas. Tech.ChEMBL_334486 (CHEMBL862515)
IC50 4.5±n/a nM
Citation Klutchko, SRZhou, HWinters, RTTran, TPBridges, AJAlthaus, IWAmato, DMElliott, WLEllis, PAMeade, MARoberts, BJFry, DWGonzales, AJHarvey, PJNelson, JMSherwood, VHan, HKPace, GSmaill, JBDenny, WAShowalter, HD Tyrosine kinase inhibitors. 19. 6-Alkynamides of 4-anilinoquinazolines and 4-anilinopyrido[3,4-d]pyrimidines as irreversible inhibitors of the erbB family of tyrosine kinase receptors. J Med Chem49:1475-85 (2006) 
 
Epidermal growth factor receptor
Name:Epidermal growth factor receptor
Type:Receptor Kinase Domain
Mol. Mass.:134279.59
Organism:Homo sapiens (Human)
Description:P00533
Residue:1210
BDBM50182688
NameBDBM50182688
Synonyms:CHEMBL204638 | N-[4-[(3-bromo-4-fluorophenyl)amino]pyrido[3,4-d]pyrimidin-6-yl]-5-(4-morpholinyl)-2-pentynamide
TypeSmall organic molecule
Emp. Form.C22H20BrFN6O2
Mol. Mass.499.336
SMILESFc1ccc(Nc2ncnc3cnc(NC(=O)C#CCCN4CCOCC4)cc23)cc1Br