Reaction Details
TargetReceptor tyrosine-protein kinase erbB-2
LigandBDBM50182698
Substrate/Competitorn/a
Meas. Tech.ChEMBL_334487 (CHEMBL862521)
IC50 7.6±n/a nM
Citation Klutchko, SRZhou, HWinters, RTTran, TPBridges, AJAlthaus, IWAmato, DMElliott, WLEllis, PAMeade, MARoberts, BJFry, DWGonzales, AJHarvey, PJNelson, JMSherwood, VHan, HKPace, GSmaill, JBDenny, WAShowalter, HD Tyrosine kinase inhibitors. 19. 6-Alkynamides of 4-anilinoquinazolines and 4-anilinopyrido[3,4-d]pyrimidines as irreversible inhibitors of the erbB family of tyrosine kinase receptors. J Med Chem49:1475-85 (2006) 
 
Receptor tyrosine-protein kinase erbB-2
Name:Receptor tyrosine-protein kinase erbB-2
Type:n/a
Mol. Mass.:137894.47
Organism:Homo sapiens (Human)
Description:P04626
Residue:1255
BDBM50182698
NameBDBM50182698
Synonyms:CHEMBL204085 | N-[4-[(3-chloro-4-fluorophenyl)amino]-6-quinazolinyl]-5-(4-morpholinyl)-2-pentynamide
TypeSmall organic molecule
Emp. Form.C23H21ClFN5O2
Mol. Mass.453.897
SMILESFc1ccc(Nc2ncnc3ccc(NC(=O)C#CCCN4CCOCC4)cc23)cc1Cl