Reaction Details
TargetEpidermal growth factor receptor
LigandBDBM50182683
Substrate/Competitorn/a
Meas. Tech.ChEMBL_334486 (CHEMBL862515)
IC50 11±n/a nM
Citation Klutchko, SRZhou, HWinters, RTTran, TPBridges, AJAlthaus, IWAmato, DMElliott, WLEllis, PAMeade, MARoberts, BJFry, DWGonzales, AJHarvey, PJNelson, JMSherwood, VHan, HKPace, GSmaill, JBDenny, WAShowalter, HD Tyrosine kinase inhibitors. 19. 6-Alkynamides of 4-anilinoquinazolines and 4-anilinopyrido[3,4-d]pyrimidines as irreversible inhibitors of the erbB family of tyrosine kinase receptors. J Med Chem49:1475-85 (2006) 
 
Epidermal growth factor receptor
Name:Epidermal growth factor receptor
Type:Receptor Kinase Domain
Mol. Mass.:134279.59
Organism:Homo sapiens (Human)
Description:P00533
Residue:1210
BDBM50182683
NameBDBM50182683
Synonyms:CHEMBL380669 | N-[4-[(3-chloro-4-fluorophenyl)amino]-6-quinazolinyl]-4-(bis-(1-methylethyl)amino)-2-butynamide
TypeSmall organic molecule
Emp. Form.C24H25ClFN5O
Mol. Mass.453.94
SMILESCC(C)N(CC#CC(=O)Nc1ccc2ncnc(Nc3ccc(F)c(Cl)c3)c2c1)C(C)C