Reaction Details
TargetEpidermal growth factor receptor
LigandBDBM50182689
Substrate/Competitorn/a
Meas. Tech.ChEMBL_334486 (CHEMBL862515)
IC50 15±n/a nM
Citation Klutchko, SRZhou, HWinters, RTTran, TPBridges, AJAlthaus, IWAmato, DMElliott, WLEllis, PAMeade, MARoberts, BJFry, DWGonzales, AJHarvey, PJNelson, JMSherwood, VHan, HKPace, GSmaill, JBDenny, WAShowalter, HD Tyrosine kinase inhibitors. 19. 6-Alkynamides of 4-anilinoquinazolines and 4-anilinopyrido[3,4-d]pyrimidines as irreversible inhibitors of the erbB family of tyrosine kinase receptors. J Med Chem49:1475-85 (2006) 
 
Epidermal growth factor receptor
Name:Epidermal growth factor receptor
Type:Receptor Kinase Domain
Mol. Mass.:134279.59
Organism:Homo sapiens (Human)
Description:P00533
Residue:1210
BDBM50182689
NameBDBM50182689
Synonyms:CHEMBL378144 | N-[4-[(3-bromophenyl)amino]pyrido[3,4-d]pyrimidin-6-yl]-2-propynamide
TypeSmall organic molecule
Emp. Form.C16H10BrN5O
Mol. Mass.368.187
SMILESBrc1cccc(Nc2ncnc3cnc(NC(=O)C#C)cc23)c1