Reaction Details
TargetReceptor tyrosine-protein kinase erbB-4
LigandBDBM50182681
Substrate/Competitorn/a
Meas. Tech.ChEMBL_334485 (CHEMBL862514)
IC50 229±n/a nM
Citation Klutchko, SRZhou, HWinters, RTTran, TPBridges, AJAlthaus, IWAmato, DMElliott, WLEllis, PAMeade, MARoberts, BJFry, DWGonzales, AJHarvey, PJNelson, JMSherwood, VHan, HKPace, GSmaill, JBDenny, WAShowalter, HD Tyrosine kinase inhibitors. 19. 6-Alkynamides of 4-anilinoquinazolines and 4-anilinopyrido[3,4-d]pyrimidines as irreversible inhibitors of the erbB family of tyrosine kinase receptors. J Med Chem49:1475-85 (2006) 
 
Receptor tyrosine-protein kinase erbB-4
Name:Receptor tyrosine-protein kinase erbB-4
Type:Protein
Mol. Mass.:146803.56
Organism:Homo sapiens (Human)
Description:Q15303
Residue:1308
BDBM50182681
NameBDBM50182681
Synonyms:CHEMBL202621 | N-[4-[(3-chloro-4-fluorophenyl)amino]-6-quinazolinyl]-4-(4-morpholinyl)-2-butynamide
TypeSmall organic molecule
Emp. Form.C22H19ClFN5O2
Mol. Mass.439.87
SMILESFc1ccc(Nc2ncnc3ccc(NC(=O)C#CCN4CCOCC4)cc23)cc1Cl