Reaction Details
TargetProthrombin
LigandBDBM50177433
Substrate/Competitorn/a
Meas. Tech.ChEMBL_334615 (CHEMBL862522)
IC50 16±n/a nM
Citation Hanessian, STherrien, Evan Otterlo, WABayrakdarian, MNilsson, IFjellström, OXue, Y Phenolic P2/P3 core motif as thrombin inhibitors--design, synthesis, and X-ray co-crystal structure. Bioorg Med Chem Lett16:1032-6 (2006) 
 
Prothrombin
Name:Prothrombin
Type:Protein
Mol. Mass.:70029.57
Organism:Homo sapiens (Human)
Description:P00734
Residue:622
BDBM50177433
NameBDBM50177433
Synonyms:CHEMBL535160 | N-(4-carbamimidoylbenzyl)-2-(2-hydroxy-3-(3-methoxyphenylsulfonamido)-6-methylphenyl)acetamide hydrochloride
TypeSmall organic molecule
Emp. Form.C24H26N4O5S
Mol. Mass.482.552
SMILESCOc1cccc(c1)S(=O)(=O)Nc1ccc(C)c(CC(=O)NCc2ccc(cc2)C(N)=N)c1O