Reaction Details
TargetSodium-dependent noradrenaline transporter
LigandBDBM50180525
Substrate/Competitorn/a
Meas. Tech.ChEMBL_344145 (CHEMBL868869)
Ki 30±n/a nM
Citation Cases-Thomas, MJMasters, JJWalter, MWCampbell, GHaughton, LGallagher, PTDobson, DRMancuso, VBonnier, BGiard, TDefrance, TVanmarsenille, MLedgard, AWhite, COuwerkerk-Mahadevan, SBrunelle, FJDezutter, NAHerbots, CALienard, JYFindlay, JHayhurst, LBoot, JThompson, LKHemrick-Luecke, S Discovery of novel and selective tertiary alcohol containing inhibitors of the norepinephrine transporter. Bioorg Med Chem Lett16:2022-5 (2006) 
 
Sodium-dependent noradrenaline transporter
Name:Sodium-dependent noradrenaline transporter
Type:Multi-pass membrane protein
Mol. Mass.:69337.72
Organism:Homo sapiens (Human)
Description:P23975
Residue:617
BDBM50180525
NameBDBM50180525
Synonyms:(R)-2-(2-chlorophenyl)-1-((S)-morpholin-2-yl)-1-phenylethanol | CHEMBL207713
TypeSmall organic molecule
Emp. Form.C18H20ClNO2
Mol. Mass.317.81
SMILESO[C@@](Cc1ccccc1Cl)([C@@H]1CNCCO1)c1ccccc1