Reaction Details
Target17-beta-hydroxysteroid dehydrogenase type 2
LigandBDBM50190006
Substrate/Competitorn/a
Meas. Tech.ChEMBL_398763 (CHEMBL908035)
IC50 100±n/a nM
Citation Wood, JBagi, CMAkuche, CBacchiocchi, ABaryza, JBlue, MLBrennan, CCampbell, AMChoi, SCook, JHConrad, PDixon, BREhrlich, PPGane, TGunn, DJoe, TJohnson, JSJordan, JKramss, RLiu, PLevy, JLowe, DBMcAlexander, INatero, RRedman, AMScott, WJTown, CWang, MWang, YZhang, Z 4,5-Disubstituted cis-pyrrolidinones as inhibitors of type II 17beta-hydroxysteroid dehydrogenase. Part 3. Identification of lead candidate. Bioorg Med Chem Lett16:4965-8 (2006) 
 
17-beta-hydroxysteroid dehydrogenase type 2
Name:17-beta-hydroxysteroid dehydrogenase type 2
Type:Oxidoreductase; single-pass type II membrane protein
Mol. Mass.:42795.29
Organism:Homo sapiens (Human)
Description:Enzyme was partially purified from human placenta.
Residue:387
BDBM50190006
NameBDBM50190006
Synonyms:(4R,5R)-5-((S)-(5-(4-fluorophenyl)thiophen-2-yl)(hydroxy)methyl)-1-methyl-4-phenylpyrrolidin-2-one | CHEMBL213667
TypeSmall organic molecule
Emp. Form.C22H20FNO2S
Mol. Mass.381.463
SMILESCN1[C@@H]([C@H](O)c2ccc(s2)-c2ccc(F)cc2)[C@H](CC1=O)c1ccccc1