Reaction Details
Target17-beta-hydroxysteroid dehydrogenase type 2
LigandBDBM50190015
Substrate/Competitorn/a
Meas. Tech.ChEMBL_398762 (CHEMBL908034)
IC50 60±n/a nM
Citation Wood, JBagi, CMAkuche, CBacchiocchi, ABaryza, JBlue, MLBrennan, CCampbell, AMChoi, SCook, JHConrad, PDixon, BREhrlich, PPGane, TGunn, DJoe, TJohnson, JSJordan, JKramss, RLiu, PLevy, JLowe, DBMcAlexander, INatero, RRedman, AMScott, WJTown, CWang, MWang, YZhang, Z 4,5-Disubstituted cis-pyrrolidinones as inhibitors of type II 17beta-hydroxysteroid dehydrogenase. Part 3. Identification of lead candidate. Bioorg Med Chem Lett16:4965-8 (2006) 
 
17-beta-hydroxysteroid dehydrogenase type 2
Name:17-beta-hydroxysteroid dehydrogenase type 2
Type:Oxidoreductase; single-pass type II membrane protein
Mol. Mass.:42795.29
Organism:Homo sapiens (Human)
Description:Enzyme was partially purified from human placenta.
Residue:387
BDBM50190015
NameBDBM50190015
Synonyms:(4R,5R)-4-(2-fluorophenyl)-5-((S)-(5-(4-fluorophenyl)thiophen-2-yl)(hydroxy)methyl)-1-methylpyrrolidin-2-one | CHEMBL215578
TypeSmall organic molecule
Emp. Form.C22H20FNO4S2
Mol. Mass.445.527
SMILESCN1[C@@H]([C@H](O)c2ccc(s2)S(=O)(=O)c2ccccc2)[C@H](CC1=O)c1ccccc1F