Reaction Details
TargetHistone deacetylase 1
LigandBDBM50195129
Substrate/Competitorn/a
Meas. Tech.ChEMBL_422136 (CHEMBL907072)
IC50 23±n/a nM
Citation Jones, PAltamura, SChakravarty, PKCecchetti, ODe Francesco, RGallinari, PIngenito, RMeinke, PTPetrocchi, ARowley, MScarpelli, RSerafini, SSteinkühler, C A series of novel, potent, and selective histone deacetylase inhibitors. Bioorg Med Chem Lett16:5948-52 (2006) 
 
Histone deacetylase 1
Name:Histone deacetylase 1
Type:Enzyme
Mol. Mass.:55090.27
Organism:Homo sapiens (Human)
Description:Q13547
Residue:482
BDBM50195129
NameBDBM50195129
Synonyms:(S)-2-(2-(5-methoxy-2-methyl-1H-indol-3-yl)acetamido)-N-(3-methoxyphenyl)-8-oxononanamide | CHEMBL384804
TypeSmall organic molecule
Emp. Form.C28H35N3O5
Mol. Mass.493.5946
SMILESCOc1cccc(NC(=O)[C@H](CCCCCC(C)=O)NC(=O)Cc2c(C)[nH]c3ccc(OC)cc23)c1