Reaction Details
TargetHistone deacetylase 1
LigandBDBM50195120
Substrate/Competitorn/a
Meas. Tech.ChEMBL_422136 (CHEMBL907072)
IC50 100±n/a nM
Citation Jones, PAltamura, SChakravarty, PKCecchetti, ODe Francesco, RGallinari, PIngenito, RMeinke, PTPetrocchi, ARowley, MScarpelli, RSerafini, SSteinkühler, C A series of novel, potent, and selective histone deacetylase inhibitors. Bioorg Med Chem Lett16:5948-52 (2006) 
 
Histone deacetylase 1
Name:Histone deacetylase 1
Type:Enzyme
Mol. Mass.:55090.27
Organism:Homo sapiens (Human)
Description:Q13547
Residue:482
BDBM50195120
NameBDBM50195120
Synonyms:(S)-N-(1-(3-chlorophenylamino)-1,8-dioxononan-2-yl)-4-methyl-1,2,3-thiadiazole-5-carboxamide | CHEMBL385238
TypeSmall organic molecule
Emp. Form.C19H23ClN4O3S
Mol. Mass.422.929
SMILESCC(=O)CCCCC[C@H](NC(=O)c1snnc1C)C(=O)Nc1cccc(Cl)c1