Reaction Details
TargetHistone deacetylase 1
LigandBDBM50195113
Substrate/Competitorn/a
Meas. Tech.ChEMBL_422136 (CHEMBL907072)
IC50 150±n/a nM
Citation Jones, PAltamura, SChakravarty, PKCecchetti, ODe Francesco, RGallinari, PIngenito, RMeinke, PTPetrocchi, ARowley, MScarpelli, RSerafini, SSteinkühler, C A series of novel, potent, and selective histone deacetylase inhibitors. Bioorg Med Chem Lett16:5948-52 (2006) 
 
Histone deacetylase 1
Name:Histone deacetylase 1
Type:Enzyme
Mol. Mass.:55090.27
Organism:Homo sapiens (Human)
Description:Q13547
Residue:482
BDBM50195113
NameBDBM50195113
Synonyms:(S)-methyl 7-(2-(5-methoxy-2-methyl-1H-indol-3-yl)acetamido)-8-oxo-8-(2-(2-phenyl-1H-indol-3-yl)ethylamino)octanoate | CHEMBL385550
TypeSmall organic molecule
Emp. Form.C37H42N4O5
Mol. Mass.622.7532
SMILESCOC(=O)CCCCC[C@H](NC(=O)Cc1c(C)[nH]c2ccc(OC)cc12)C(=O)NCCc1c([nH]c2ccccc12)-c1ccccc1