Reaction Details
TargetProstacyclin receptor
LigandBDBM50097792
Substrate/Competitorn/a
Meas. Tech.ChEMBL_424243 (CHEMBL909017)
Ki>500±n/a nM
Citation Belley, MChan, CCGareau, YGallant, MJuteau, HHoude, KLachance, NLabelle, MSawyer, NTremblay, NLamontagne, SCarrière, MCDenis, DGreig, GMSlipetz, DGordon, RChauret, NLi, CZamboni, RJMetters, KM Comparison between two classes of selective EP(3) antagonists and their biological activities. Bioorg Med Chem Lett16:5639-42 (2006) 
 
Prostacyclin receptor
Name:Prostacyclin receptor
Type:G Protein-Coupled Receptor (GPCR)
Mol. Mass.:40968.22
Organism:Homo sapiens (Human)
Description:The membranes prepared from human platelet were used in binding assay.
Residue:386
BDBM50097792
NameBDBM50097792
Synonyms:(E)-3-(2-Naphthalen-2-ylmethyl-phenyl)-acrylic acid CHEMBL423815
TypeSmall organic molecule
Emp. Form.C20H16O2
Mol. Mass.288.3398
SMILESOC(=O)\C=C\c1ccccc1Cc1ccc2ccccc2c1