Reaction Details
TargetProstaglandin F2-alpha receptor
LigandBDBM50097792
Substrate/Competitorn/a
Meas. Tech.ChEMBL_424245 (CHEMBL909019)
Ki>500±n/a nM
Citation Belley, MChan, CCGareau, YGallant, MJuteau, HHoude, KLachance, NLabelle, MSawyer, NTremblay, NLamontagne, SCarrière, MCDenis, DGreig, GMSlipetz, DGordon, RChauret, NLi, CZamboni, RJMetters, KM Comparison between two classes of selective EP(3) antagonists and their biological activities. Bioorg Med Chem Lett16:5639-42 (2006) 
 
Prostaglandin F2-alpha receptor
Name:Prostaglandin F2-alpha receptor
Type:Enzyme
Mol. Mass.:40072.29
Organism:Homo sapiens (Human)
Description:P43088
Residue:359
BDBM50097792
NameBDBM50097792
Synonyms:(E)-3-(2-Naphthalen-2-ylmethyl-phenyl)-acrylic acid CHEMBL423815
TypeSmall organic molecule
Emp. Form.C20H16O2
Mol. Mass.288.3398
SMILESOC(=O)\C=C\c1ccccc1Cc1ccc2ccccc2c1