Reaction Details
TargetP2Y purinoceptor 6
LigandBDBM50205413
Substrate/Competitorn/a
Meas. Tech.ChEMBL_428327 (CHEMBL917105)
EC50 20000±n/a nM
Citation Ivanov, AAKo, HCosyn, LMaddileti, SBesada, PFricks, ICostanzi, SHarden, TKCalenbergh, SVJacobson, KA Molecular modeling of the human P2Y2 receptor and design of a selective agonist, 2'-amino-2'-deoxy-2-thiouridine 5'-triphosphate. J Med Chem50:1166-76 (2007) 
 
P2Y purinoceptor 6
Name:P2Y purinoceptor 6
Type:PROTEIN
Mol. Mass.:36452.29
Organism:Homo sapiens (Human)
Description:ChEMBL_1511151
Residue:328
BDBM50205413
NameBDBM50205413
Synonyms:CHEMBL221326 P1,P4-Bis(5'-uridyl) tetrahydrogen tetraphosphate
TypeSmall organic molecule
Emp. Form.C18H26N4O23P4
Mol. Mass.790.3071
SMILESO[C@@H]1[C@@H](COP(O)(=O)OP(O)(=O)OP(O)(=O)OP(O)(=O)OC[C@H]2O[C@H]([C@H](O)[C@@H]2O)n2ccc(=O)[nH]c2=O)O[C@H]([C@@H]1O)n1ccc(=O)[nH]c1=O