Reaction Details
TargetP2Y purinoceptor 2
LigandBDBM50205416
Substrate/Competitorn/a
Meas. Tech.ChEMBL_428323 (CHEMBL917101)
EC50 1080±n/a nM
Citation Ivanov, AAKo, HCosyn, LMaddileti, SBesada, PFricks, ICostanzi, SHarden, TKCalenbergh, SVJacobson, KA Molecular modeling of the human P2Y2 receptor and design of a selective agonist, 2'-amino-2'-deoxy-2-thiouridine 5'-triphosphate. J Med Chem50:1166-76 (2007) 
 
P2Y purinoceptor 2
Name:P2Y purinoceptor 2
Type:PROTEIN
Mol. Mass.:42299.21
Organism:Homo sapiens (Human)
Description:ChEMBL_1455361
Residue:377
BDBM50205416
NameBDBM50205416
Synonyms:2'-deoxyuridine 5'-(tetrahydrogen triphosphate) dUTP
TypeSmall organic molecule
Emp. Form.C9H15N2O14P3
Mol. Mass.468.1417
SMILESO[C@H]1C[C@@H](O[C@@H]1COP(O)(=O)OP(O)(=O)OP(O)(O)=O)n1ccc(=O)[nH]c1=O