Reaction Details
TargetPhosphatidylinositol 4,5-bisphosphate 3-kinase catalytic subunit beta isoform
LigandBDBM25018
Substrate/Competitorn/a
Meas. Tech.ChEMBL_438488 (CHEMBL887588)
IC50 16±n/a nM
Citation Hayakawa, MKaizawa, HMoritomo, HKoizumi, TOhishi, TYamano, MOkada, MOhta, MTsukamoto, SRaynaud, FIWorkman, PWaterfield, MDParker, P Synthesis and biological evaluation of pyrido[3',2':4,5]furo[3,2-d]pyrimidine derivatives as novel PI3 kinase p110alpha inhibitors. Bioorg Med Chem Lett17:2438-42 (2007) 
 
Phosphatidylinositol 4,5-bisphosphate 3-kinase catalytic subunit beta isoform
Name:Phosphatidylinositol 4,5-bisphosphate 3-kinase catalytic subunit beta isoform
Type:Enzyme Subunit
Mol. Mass.:122769.00
Organism:Homo sapiens (Human)
Description:P42338
Residue:1070
BDBM25018
NameBDBM25018
Synonyms:3-(4-morpholin-4-ylthieno[3,2-d]pyrimidin-2-yl)phenol CHEMBL541643 thienopyrimidine derivative, 1
TypeSmall organic molecule
Emp. Form.C16H15N3O2S
Mol. Mass.313.374
SMILESOc1cccc(c1)-c1nc(N2CCOCC2)c2sccc2n1