Reaction Details
TargetMu-type opioid receptor
LigandBDBM50027234
Substrate/Competitorn/a
Meas. Tech.ChEMBL_439880 (CHEMBL890201)
Ki 4810±n/a nM
Citation Simpson, DSKatavic, PLLozama, AHarding, WWParrish, DDeschamps, JRDersch, CMPartilla, JSRothman, RBNavarro, HPrisinzano, TE Synthetic studies of neoclerodane diterpenes from Salvia divinorum: preparation and opioid receptor activity of salvinicin analogues. J Med Chem50:3596-603 (2007) 
 
Mu-type opioid receptor
Name:Mu-type opioid receptor
Type:G Protein-Coupled Receptor (GPCR)
Mol. Mass.:44789.51
Organism:Homo sapiens (Human)
Description:P35372
Residue:400
BDBM50027234
NameBDBM50027234
Synonyms:CHEMBL2113278
TypeSmall organic molecule
Emp. Form.C25H36O10
Mol. Mass.496.5473
SMILES[H][C@]1(C[C@@]2(C)[C@@]([H])(CC[C@@]3(C)[C@@H](C[C@H](OC(C)=O)C(=O)[C@]23[H])C(=O)OC)C(=O)O1)C1CC(OC)OC1OC