Reaction Details
TargetDelta-type opioid receptor
LigandBDBM50216132
Substrate/Competitorn/a
Meas. Tech.ChEMBL_439881 (CHEMBL890202)
Ki 7620±n/a nM
Citation Simpson, DSKatavic, PLLozama, AHarding, WWParrish, DDeschamps, JRDersch, CMPartilla, JSRothman, RBNavarro, HPrisinzano, TE Synthetic studies of neoclerodane diterpenes from Salvia divinorum: preparation and opioid receptor activity of salvinicin analogues. J Med Chem50:3596-603 (2007) 
 
Delta-type opioid receptor
Name:Delta-type opioid receptor
Type:G Protein-Coupled Receptor (GPCR)
Mol. Mass.:40382.98
Organism:Homo sapiens (Human)
Description:Competition binding assays were carried out using membrane preparations from transfected HN9.10 cells that constitutively expressed the delta opioid receptor.
Residue:372
BDBM50216132
NameBDBM50216132
Synonyms:(2S,4aR,6aR,7R,9S,10aS,10bR)-methyl 9-acetoxy-2-(2-bromofuran-3-yl)-6a,10b-dimethyl-4,10-dioxo-dodecahydro-1H-benzo[f]isochromene-7-carboxylate CHEMBL390935
TypeSmall organic molecule
Emp. Form.C23H27BrO8
Mol. Mass.511.36
SMILESCOC(=O)[C@@H]1C[C@H](OC(C)=O)C(=O)[C@H]2[C@@]1(C)CC[C@H]1C(=O)O[C@@H](C[C@]21C)c1ccoc1Br