Reaction Details
TargetMu-type opioid receptor
LigandBDBM50216135
Substrate/Competitorn/a
Meas. Tech.ChEMBL_439885 (CHEMBL890206)
Ki>10000±n/a nM
Citation Simpson, DSKatavic, PLLozama, AHarding, WWParrish, DDeschamps, JRDersch, CMPartilla, JSRothman, RBNavarro, HPrisinzano, TE Synthetic studies of neoclerodane diterpenes from Salvia divinorum: preparation and opioid receptor activity of salvinicin analogues. J Med Chem50:3596-603 (2007) 
 
Mu-type opioid receptor
Name:Mu-type opioid receptor
Type:G Protein-Coupled Receptor (GPCR)
Mol. Mass.:44789.51
Organism:Homo sapiens (Human)
Description:P35372
Residue:400
BDBM50216135
NameBDBM50216135
Synonyms:(1R,2R,4aR,5R,7S,8aR)-7-acetoxy-5-(methoxycarbonyl)-4a-methyl-8-oxo-1-(2-(tetrahydrofuran-3-yl)ethyl)-decahydronaphthalene-2-carboxylic acid | CHEMBL226677
TypeSmall organic molecule
Emp. Form.C23H34O8
Mol. Mass.438.5113
SMILESCOC(=O)[C@@H]1C[C@H](OC(C)=O)C(=O)[C@@H]2[C@@](C)(CCC3CCOC3)[C@@H](CC[C@@]12C)C(O)=O