Reaction Details
TargetMu-type opioid receptor
LigandBDBM50216134
Substrate/Competitorn/a
Meas. Tech.ChEMBL_439885 (CHEMBL890206)
Ki 2930±n/a nM
Citation Simpson, DSKatavic, PLLozama, AHarding, WWParrish, DDeschamps, JRDersch, CMPartilla, JSRothman, RBNavarro, HPrisinzano, TE Synthetic studies of neoclerodane diterpenes from Salvia divinorum: preparation and opioid receptor activity of salvinicin analogues. J Med Chem50:3596-603 (2007) 
 
Mu-type opioid receptor
Name:Mu-type opioid receptor
Type:G Protein-Coupled Receptor (GPCR)
Mol. Mass.:44789.51
Organism:Homo sapiens (Human)
Description:P35372
Residue:400
BDBM50216134
NameBDBM50216134
Synonyms:(4aR,6aR,7R,9S,10aS,10bR)-methyl 9-acetoxy-2-((2R,5S)-2,5-dimethoxy-2,5-dihydrofuran-3-yl)dodecahydro-6a,10b-dimethyl-4,10-dioxo-2H-naphtho[2,1-c]pyran-7-carboxylic acid | CHEMBL434746
TypeSmall organic molecule
Emp. Form.C25H34O10
Mol. Mass.494.5315
SMILESCO[C@H]1O[C@@H](OC)C(=C1)[C@@H]1C[C@@]2(C)[C@@H](CC[C@@]3(C)[C@@H](C[C@H](OC(C)=O)C(=O)[C@H]23)C(=O)OC)C(=O)O1