Reaction Details
TargetAcetylcholinesterase
LigandBDBM50221906
Substrate/Competitorn/a
Meas. Tech.ChEMBL_446304 (CHEMBL895407)
IC50 123±n/a nM
Citation Bolognesi, MLBanzi, RBartolini, MCavalli, ATarozzi, AAndrisano, VMinarini, ARosini, MTumiatti, VBergamini, CFato, RLenaz, GHrelia, PCattaneo, ARecanatini, MMelchiorre, C Novel class of quinone-bearing polyamines as multi-target-directed ligands to combat Alzheimer's disease. J Med Chem50:4882-97 (2007) 
 
Acetylcholinesterase
Name:Acetylcholinesterase
Type:Enzyme
Mol. Mass.:67792.70
Organism:Homo sapiens (Human)
Description:P22303
Residue:614
BDBM50221906
NameBDBM50221906
Synonyms:2,5-bis[6-(2-methoxybenzylamino)hexylamino]-[1,4]-benzoquinone | CHEMBL243044
TypeSmall organic molecule
Emp. Form.C34H48N4O4
Mol. Mass.576.7693
SMILESCOc1ccccc1CNCCCCCCNc1cc(O)c(cc1O)N=CCCCCCNCc1ccccc1OC