Reaction Details
TargetAcetylcholinesterase
LigandBDBM50221918
Substrate/Competitorn/a
Meas. Tech.ChEMBL_446304 (CHEMBL895407)
IC50 2.7±n/a nM
Citation Bolognesi, MLBanzi, RBartolini, MCavalli, ATarozzi, AAndrisano, VMinarini, ARosini, MTumiatti, VBergamini, CFato, RLenaz, GHrelia, PCattaneo, ARecanatini, MMelchiorre, C Novel class of quinone-bearing polyamines as multi-target-directed ligands to combat Alzheimer's disease. J Med Chem50:4882-97 (2007) 
 
Acetylcholinesterase
Name:Acetylcholinesterase
Type:Enzyme
Mol. Mass.:67792.70
Organism:Homo sapiens (Human)
Description:P22303
Residue:614
BDBM50221918
NameBDBM50221918
Synonyms:2,5-bis{6-[ethyl(2-methoxybenzyl)amino]hexylamino}-3,6-dibromo-[1,4]-benzoquinone | CHEMBL243062
TypeSmall organic molecule
Emp. Form.C38H54Br2N4O4
Mol. Mass.790.668
SMILESCCN(CCCCCCNc1c(O)c(Br)c(N=CCCCCCN(CC)Cc2ccccc2OC)c(O)c1Br)Cc1ccccc1OC