Reaction Details
TargetCholinesterase
LigandBDBM50221932
Substrate/Competitorn/a
Meas. Tech.ChEMBL_446305 (CHEMBL895408)
IC50 518±n/a nM
Citation Bolognesi, MLBanzi, RBartolini, MCavalli, ATarozzi, AAndrisano, VMinarini, ARosini, MTumiatti, VBergamini, CFato, RLenaz, GHrelia, PCattaneo, ARecanatini, MMelchiorre, C Novel class of quinone-bearing polyamines as multi-target-directed ligands to combat Alzheimer's disease. J Med Chem50:4882-97 (2007) 
 
Cholinesterase
Name:Cholinesterase
Type:Homotetramer
Mol. Mass.:68422.27
Organism:Homo sapiens (Human)
Description:P06276
Residue:602
BDBM50221932
NameBDBM50221932
Synonyms:2,5-bis(6-{ethyl[2-(2-methoxyphenyl)ethyl]amino}hexylamino)-[1,4]-benzoquinone | CHEMBL394348
TypeSmall organic molecule
Emp. Form.C40H60N4O4
Mol. Mass.660.9288
SMILESCCN(CCCCCCNc1cc(O)c(cc1O)N=CCCCCCN(CC)CCc1ccccc1OC)CCc1ccccc1OC