Reaction Details
TargetAcetylcholinesterase
LigandBDBM50221911
Substrate/Competitorn/a
Meas. Tech.ChEMBL_446304 (CHEMBL895407)
IC50 192±n/a nM
Citation Bolognesi, MLBanzi, RBartolini, MCavalli, ATarozzi, AAndrisano, VMinarini, ARosini, MTumiatti, VBergamini, CFato, RLenaz, GHrelia, PCattaneo, ARecanatini, MMelchiorre, C Novel class of quinone-bearing polyamines as multi-target-directed ligands to combat Alzheimer's disease. J Med Chem50:4882-97 (2007) 
 
Acetylcholinesterase
Name:Acetylcholinesterase
Type:Enzyme
Mol. Mass.:67792.70
Organism:Homo sapiens (Human)
Description:P22303
Residue:614
BDBM50221911
NameBDBM50221911
Synonyms:2,5-bis{6-[ethyl(pyridin-4-ylmethyl)amino]hexylamino}-[1,4]-benzoquinone | CHEMBL241960
TypeSmall organic molecule
Emp. Form.C34H50N6O2
Mol. Mass.574.7998
SMILESCCN(CCCCCCNc1cc(O)c(cc1O)N=CCCCCCN(CC)Cc1ccncc1)Cc1ccncc1