Reaction Details
TargetAcetylcholinesterase
LigandBDBM50221928
Substrate/Competitorn/a
Meas. Tech.ChEMBL_446304 (CHEMBL895407)
IC50 72±n/a nM
Citation Bolognesi, MLBanzi, RBartolini, MCavalli, ATarozzi, AAndrisano, VMinarini, ARosini, MTumiatti, VBergamini, CFato, RLenaz, GHrelia, PCattaneo, ARecanatini, MMelchiorre, C Novel class of quinone-bearing polyamines as multi-target-directed ligands to combat Alzheimer's disease. J Med Chem50:4882-97 (2007) 
 
Acetylcholinesterase
Name:Acetylcholinesterase
Type:Enzyme
Mol. Mass.:67792.70
Organism:Homo sapiens (Human)
Description:P22303
Residue:614
BDBM50221928
NameBDBM50221928
Synonyms:2,5-bis{6-[ethyl(2-methylbenzyl)amino]hexylamino}-[1,4]-benzoquinone | CHEMBL243274
TypeSmall organic molecule
Emp. Form.C38H56N4O2
Mol. Mass.600.8768
SMILESCCN(CCCCCCNc1cc(O)c(cc1O)N=CCCCCCN(CC)Cc1ccccc1C)Cc1ccccc1C