Reaction Details
Target5-hydroxytryptamine receptor 2C
LigandBDBM50222854
Substrate/Competitorn/a
Meas. Tech.ChEMBL_446533 (CHEMBL896830)
Ki>1000±n/a nM
Citation Rudolph, JEsler, WPO'connor, SCoish, PDWickens, PLBrands, MBierer, DEBloomquist, BTBondar, GChen, LChuang, CYClaus, THFathi, ZFu, WKhire, URKristie, JALiu, XGLowe, DBMcClure, ACMichels, MOrtiz, AARamsden, PDSchoenleber, RWShelekhin, TEVakalopoulos, ATang, WWang, LYi, LGardell, SJLivingston, JNSweet, LJBullock, WH Quinazolinone derivatives as orally available ghrelin receptor antagonists for the treatment of diabetes and obesity. J Med Chem50:5202-16 (2007) 
 
5-hydroxytryptamine receptor 2C
Name:5-hydroxytryptamine receptor 2C
Type:G Protein-Coupled Receptor (GPCR)
Mol. Mass.:51836.79
Organism:Homo sapiens (Human)
Description:P28335
Residue:458
BDBM50222854
NameBDBM50222854
Synonyms:6-(4-luorophenoxy)-3-{[(3S)-1-isopropylpiperidin-3-yl]-methyl}quinazolin-4(3H)-one | CHEMBL243703
TypeSmall organic molecule
Emp. Form.C23H26FN3O2
Mol. Mass.395.4698
SMILESCC(C)N1CCC[C@H](Cn2cnc3ccc(Oc4ccc(F)cc4)cc3c2=O)C1