Reaction Details
TargetGrowth hormone secretagogue receptor type 1
LigandBDBM50222884
Substrate/Competitorn/a
Meas. Tech.ChEMBL_446527 (CHEMBL895698)
Ki 1.8±n/a nM
Citation Rudolph, JEsler, WPO'connor, SCoish, PDWickens, PLBrands, MBierer, DEBloomquist, BTBondar, GChen, LChuang, CYClaus, THFathi, ZFu, WKhire, URKristie, JALiu, XGLowe, DBMcClure, ACMichels, MOrtiz, AARamsden, PDSchoenleber, RWShelekhin, TEVakalopoulos, ATang, WWang, LYi, LGardell, SJLivingston, JNSweet, LJBullock, WH Quinazolinone derivatives as orally available ghrelin receptor antagonists for the treatment of diabetes and obesity. J Med Chem50:5202-16 (2007) 
 
Growth hormone secretagogue receptor type 1
Name:Growth hormone secretagogue receptor type 1
Synonyms:Ghrelin receptor
Type:PROTEIN
Mol. Mass.:41494.35
Organism:Ovis aries
Description:ChEMBL_446527
Residue:366
BDBM50222884
NameBDBM50222884
TypeSmall organic molecule
Emp. Form.C29H30ClN3O
Mol. Mass.472.021
SMILESCCN1CCCC(Cn2c(nc3ccc(cc3c2=O)-c2ccc(Cl)cc2)-c2ccccc2C)C1