Reaction Details
TargetSerine/threonine-protein kinase Chk1
LigandBDBM50222918
Substrate/Competitorn/a
Meas. Tech.ChEMBL_449978 (CHEMBL899086)
Ki 1.2±n/a nM
Citation Teng, MZhu, JJohnson, MDChen, PKornmann, JChen, EBlasina, ARegister, JAnderes, KRogers, CDeng, YNinkovic, SGrant, SHu, QLundgren, KPeng, ZKania, RS Structure-based design and synthesis of (5-arylamino-2H-pyrazol-3-yl)-biphenyl-2',4'-diols as novel and potent human CHK1 inhibitors. J Med Chem50:5253-6 (2007) 
 
Serine/threonine-protein kinase Chk1
Name:Serine/threonine-protein kinase Chk1
Type:Enzyme Catalytic Domain
Mol. Mass.:54443.02
Organism:Homo sapiens (Human)
Description:gi_166295192
Residue:476
BDBM50222918
NameBDBM50222918
Synonyms:4'-(5-phenylamino-2H-pyrazol-3-yl)-biphenyl-2,4-diol | CHEMBL241024
TypeSmall organic molecule
Emp. Form.C21H17N3O2
Mol. Mass.343.3786
SMILESOc1ccc(c(O)c1)-c1ccc(cc1)-c1cc(Nc2ccccc2)[nH]n1