Reaction Details
TargetSerine/threonine-protein kinase 26
LigandBDBM50222913
Substrate/Competitorn/a
Meas. Tech.ChEMBL_450012 (CHEMBL899109)
IC50 1850±n/a nM
Citation Teng, MZhu, JJohnson, MDChen, PKornmann, JChen, EBlasina, ARegister, JAnderes, KRogers, CDeng, YNinkovic, SGrant, SHu, QLundgren, KPeng, ZKania, RS Structure-based design and synthesis of (5-arylamino-2H-pyrazol-3-yl)-biphenyl-2',4'-diols as novel and potent human CHK1 inhibitors. J Med Chem50:5253-6 (2007) 
 
Serine/threonine-protein kinase 26
Name:Serine/threonine-protein kinase 26
Type:PROTEIN
Mol. Mass.:46517.68
Organism:Homo sapiens (Human)
Description:ChEMBL_1510631
Residue:416
BDBM50222913
NameBDBM50222913
Synonyms:4'-{5-[4-(isopropylamino-methyl)-phenylamino]-2H-pyrazol-3-yl}-biphenyl-2,4-diol | CHEMBL398606
TypeSmall organic molecule
Emp. Form.C25H26N4O2
Mol. Mass.414.4995
SMILESCC(C)NCc1ccc(Nc2cc(n[nH]2)-c2ccc(cc2)-c2ccc(O)cc2O)cc1