Reaction Details
Target5-hydroxytryptamine receptor 2A
LigandBDBM50212239
Substrate/Competitorn/a
Meas. Tech.ChEMBL_460799 (CHEMBL944740)
IC50>2000±n/a nM
Citation Kort, MEDrizin, IGregg, RJScanio, MJShi, LGross, MFAtkinson, RNJohnson, MSPacofsky, GJThomas, JBCarroll, WAKrambis, MJLiu, DShieh, CCZhang, XHernandez, GMikusa, JPZhong, CJoshi, SHonore, PRoeloffs, RMarsh, KCMurray, BPLiu, JWerness, SFaltynek, CRKrafte, DSJarvis, MFChapman, MLMarron, BE Discovery and biological evaluation of 5-aryl-2-furfuramides, potent and selective blockers of the Nav1.8 sodium channel with efficacy in models of neuropathic and inflammatory pain. J Med Chem51:407-16 (2008) 
 
5-hydroxytryptamine receptor 2A
Name:5-hydroxytryptamine receptor 2A
Type:undefined
Mol. Mass.:52607.65
Organism:Homo sapiens (Human)
Description:P28223
Residue:471
BDBM50212239
NameBDBM50212239
Synonyms:5-(4-chlorophenyl)-N-(3,5-dimethoxyphenyl)furan-2-carboxamide CHEMBL250699
TypeSmall organic molecule
Emp. Form.C19H16ClNO4
Mol. Mass.357.788
SMILESCOc1cc(NC(=O)c2ccc(o2)-c2ccc(Cl)cc2)cc(OC)c1