Reaction Details
TargetPotassium voltage-gated channel subfamily H member 2
LigandBDBM50231767
Substrate/Competitorn/a
Meas. Tech.ChEMBL_460777 (CHEMBL944718)
IC50 5800±n/a nM
Citation Kort, MEDrizin, IGregg, RJScanio, MJShi, LGross, MFAtkinson, RNJohnson, MSPacofsky, GJThomas, JBCarroll, WAKrambis, MJLiu, DShieh, CCZhang, XHernandez, GMikusa, JPZhong, CJoshi, SHonore, PRoeloffs, RMarsh, KCMurray, BPLiu, JWerness, SFaltynek, CRKrafte, DSJarvis, MFChapman, MLMarron, BE Discovery and biological evaluation of 5-aryl-2-furfuramides, potent and selective blockers of the Nav1.8 sodium channel with efficacy in models of neuropathic and inflammatory pain. J Med Chem51:407-16 (2008) 
 
Potassium voltage-gated channel subfamily H member 2
Name:Potassium voltage-gated channel subfamily H member 2
Type:Multi-pass membrane protein
Mol. Mass.:126672.65
Organism:Homo sapiens (Human)
Description:Q12809
Residue:1159
BDBM50231767
NameBDBM50231767
Synonyms:5-(4-cyanophenyl)-N-(3-methylphenyl)furan-2-carboxamide | CHEMBL401258
TypeSmall organic molecule
Emp. Form.C19H14N2O2
Mol. Mass.302.3267
SMILESCc1cccc(NC(=O)c2ccc(o2)-c2ccc(cc2)C#N)c1